{"text_format":"1","workbook":"xlsx","n_sheets":3,"sheets":["Beurteilung","Gefährdungsfaktoren","Risikobewertung"],"not_rendered":{"charts":0,"images":1,"macros":1,"external_links":0,"defined_names":1,"comments":0,"pivot_tables":0},"unopened":[],"bounds":{"document_bytes":16777216,"sheet_cells":100000,"rows_first":2000,"rows_last":500,"rows_between":2000,"halvings":0,"cell_chars":16384,"cell_head_chars":4096},"cells_cut":0,"cells_raw":0,"read":"whole","date_system":"1900"}

{"sheet":"Beurteilung","index":0,"n_rows":78,"n_cols":15,"rows_kept":78,"cut":false,"hidden":false,"merged":[[0,0,0,12],[6,8,6,9],[6,11,6,12],[6,13,6,14],[1,0,2,1]]}
["Gefährdungsbeurteilung"]
["[##BEREICH##]",null,null,"Version: ","Beschreibung Arbeitsbereich"]
[null,null,null,"Erstellt von:"]
["Hochschule Bochum",null,null,"Erstellt am:",null,null,null,null,null,"          gering - mittel - hoch"]
["Am Hochschulcampus 1",null,null,"Letzte Änderung von:"]
["44801 Bochum",null,null,"Letzte Änderung am:"]
["Nr.","Art","Gruppe der Gefährdung","Ursache der Gefährdung","Schadensausmaß","Wertung","Eintrittswarscheinlichkeit","Wertung","Risikoniveau",null,"Schutzmaßnahmen","Umsetzung",null,"Bemerkungen"]
[null,null,"siehe Gefährdungsfaktoren",null,{"$f":"IF(F8=\"\",\"#bitte Buchstaben rechts wählen\",INDEX(Risikobewertung!$B$2:$F$2,MATCH(Beurteilung!F8,Risikobewertung!$B$8:$F$8,0)))","v":"#bitte Buchstaben rechts wählen"},null,{"$f":"IF(H8=\"\",\"#Bitte Zahl rechts wählen\",INDEX(Risikobewertung!$A$3:$A$7,MATCH(Beurteilung!H8,Risikobewertung!$G$3:$G$7,0)))","v":"#Bitte Zahl rechts wählen"},null,{"$f":"IF(OR(F8=\"\",H8=\"\"),\"Wertungen eingeben\",INDEX(Risikobewertung!$B$3:$F$7,MATCH(H8,Risikobewertung!$G$3:$G$7,0),MATCH(Beurteilung!F8,Risikobewertung!$B$8:$F$8,0)))","v":"Wertungen eingeben"},{"$f":"IF(OR(F8=\"\",H8=\"\"),\"\",INDEX(Risikobewertung!$G$33:$G$57,MATCH(F8&H8,Risikobewertung!$D$33:$D$57,0)))","v":""},"Technisch/ Organisatorisch/ Personenbezogen","Verantwortlich","bis wann","Bewertungsbegründung","Bemerkungen"]
[null,null,null,null,{"$f":"IF(F9=\"\",\"#bitte Buchstaben rechts wählen\",INDEX(Risikobewertung!$B$2:$F$2,MATCH(Beurteilung!F9,Risikobewertung!$B$8:$F$8,0)))","v":"#bitte Buchstaben rechts wählen"},null,{"$f":"IF(H9=\"\",\"#Bitte Zahl rechts wählen\",INDEX(Risikobewertung!$A$3:$A$7,MATCH(Beurteilung!H9,Risikobewertung!$G$3:$G$7,0)))","v":"#Bitte Zahl rechts wählen"},null,{"$f":"IF(OR(F9=\"\",H9=\"\"),\"Wertungen eingeben\",INDEX(Risikobewertung!$B$3:$F$7,MATCH(H9,Risikobewertung!$G$3:$G$7,0),MATCH(Beurteilung!F9,Risikobewertung!$B$8:$F$8,0)))","v":"Wertungen eingeben"},{"$f":"IF(OR(F9=\"\",H9=\"\"),\"\",INDEX(Risikobewertung!$G$33:$G$57,MATCH(F9&H9,Risikobewertung!$D$33:$D$57,0)))","v":""}]
[null,null,null,null,{"$f":"IF(F10=\"\",\"#bitte Buchstaben rechts wählen\",INDEX(Risikobewertung!$B$2:$F$2,MATCH(Beurteilung!F10,Risikobewertung!$B$8:$F$8,0)))","v":"#bitte Buchstaben rechts wählen"},null,{"$f":"IF(H10=\"\",\"#Bitte Zahl rechts wählen\",INDEX(Risikobewertung!$A$3:$A$7,MATCH(Beurteilung!H10,Risikobewertung!$G$3:$G$7,0)))","v":"#Bitte Zahl rechts wählen"},null,{"$f":"IF(OR(F10=\"\",H10=\"\"),\"Wertungen eingeben\",INDEX(Risikobewertung!$B$3:$F$7,MATCH(H10,Risikobewertung!$G$3:$G$7,0),MATCH(Beurteilung!F10,Risikobewertung!$B$8:$F$8,0)))","v":"Wertungen eingeben"},{"$f":"IF(OR(F10=\"\",H10=\"\"),\"\",INDEX(Risikobewertung!$G$33:$G$57,MATCH(F10&H10,Risikobewertung!$D$33:$D$57,0)))","v":""}]
[null,null,null,null,{"$f":"IF(F11=\"\",\"#bitte Buchstaben rechts wählen\",INDEX(Risikobewertung!$B$2:$F$2,MATCH(Beurteilung!F11,Risikobewertung!$B$8:$F$8,0)))","v":"#bitte Buchstaben rechts wählen"},null,{"$f":"IF(H11=\"\",\"#Bitte Zahl rechts wählen\",INDEX(Risikobewertung!$A$3:$A$7,MATCH(Beurteilung!H11,Risikobewertung!$G$3:$G$7,0)))","v":"#Bitte Zahl rechts wählen"},null,{"$f":"IF(OR(F11=\"\",H11=\"\"),\"Wertungen eingeben\",INDEX(Risikobewertung!$B$3:$F$7,MATCH(H11,Risikobewertung!$G$3:$G$7,0),MATCH(Beurteilung!F11,Risikobewertung!$B$8:$F$8,0)))","v":"Wertungen eingeben"},{"$f":"IF(OR(F11=\"\",H11=\"\"),\"\",INDEX(Risikobewertung!$G$33:$G$57,MATCH(F11&H11,Risikobewertung!$D$33:$D$57,0)))","v":""}]
[null,null,null,null,{"$f":"IF(F12=\"\",\"#bitte Buchstaben rechts wählen\",INDEX(Risikobewertung!$B$2:$F$2,MATCH(Beurteilung!F12,Risikobewertung!$B$8:$F$8,0)))","v":"#bitte Buchstaben rechts wählen"},null,{"$f":"IF(H12=\"\",\"#Bitte Zahl rechts wählen\",INDEX(Risikobewertung!$A$3:$A$7,MATCH(Beurteilung!H12,Risikobewertung!$G$3:$G$7,0)))","v":"#Bitte Zahl rechts wählen"},null,{"$f":"IF(OR(F12=\"\",H12=\"\"),\"Wertungen eingeben\",INDEX(Risikobewertung!$B$3:$F$7,MATCH(H12,Risikobewertung!$G$3:$G$7,0),MATCH(Beurteilung!F12,Risikobewertung!$B$8:$F$8,0)))","v":"Wertungen eingeben"},{"$f":"IF(OR(F12=\"\",H12=\"\"),\"\",INDEX(Risikobewertung!$G$33:$G$57,MATCH(F12&H12,Risikobewertung!$D$33:$D$57,0)))","v":""}]
[null,null,null,null,{"$f":"IF(F13=\"\",\"#bitte Buchstaben rechts wählen\",INDEX(Risikobewertung!$B$2:$F$2,MATCH(Beurteilung!F13,Risikobewertung!$B$8:$F$8,0)))","v":"#bitte Buchstaben rechts wählen"},null,{"$f":"IF(H13=\"\",\"#Bitte Zahl rechts wählen\",INDEX(Risikobewertung!$A$3:$A$7,MATCH(Beurteilung!H13,Risikobewertung!$G$3:$G$7,0)))","v":"#Bitte Zahl rechts wählen"},null,{"$f":"IF(OR(F13=\"\",H13=\"\"),\"Wertungen eingeben\",INDEX(Risikobewertung!$B$3:$F$7,MATCH(H13,Risikobewertung!$G$3:$G$7,0),MATCH(Beurteilung!F13,Risikobewertung!$B$8:$F$8,0)))","v":"Wertungen eingeben"},{"$f":"IF(OR(F13=\"\",H13=\"\"),\"\",INDEX(Risikobewertung!$G$33:$G$57,MATCH(F13&H13,Risikobewertung!$D$33:$D$57,0)))","v":""}]
[null,null,null,null,{"$f":"IF(F14=\"\",\"#bitte Buchstaben rechts wählen\",INDEX(Risikobewertung!$B$2:$F$2,MATCH(Beurteilung!F14,Risikobewertung!$B$8:$F$8,0)))","v":"#bitte Buchstaben rechts wählen"},null,{"$f":"IF(H14=\"\",\"#Bitte Zahl rechts wählen\",INDEX(Risikobewertung!$A$3:$A$7,MATCH(Beurteilung!H14,Risikobewertung!$G$3:$G$7,0)))","v":"#Bitte Zahl rechts wählen"},null,{"$f":"IF(OR(F14=\"\",H14=\"\"),\"Wertungen eingeben\",INDEX(Risikobewertung!$B$3:$F$7,MATCH(H14,Risikobewertung!$G$3:$G$7,0),MATCH(Beurteilung!F14,Risikobewertung!$B$8:$F$8,0)))","v":"Wertungen eingeben"},{"$f":"IF(OR(F14=\"\",H14=\"\"),\"\",INDEX(Risikobewertung!$G$33:$G$57,MATCH(F14&H14,Risikobewertung!$D$33:$D$57,0)))","v":""}]
[null,null,null,null,{"$f":"IF(F15=\"\",\"#bitte Buchstaben rechts wählen\",INDEX(Risikobewertung!$B$2:$F$2,MATCH(Beurteilung!F15,Risikobewertung!$B$8:$F$8,0)))","v":"#bitte Buchstaben rechts wählen"},null,{"$f":"IF(H15=\"\",\"#Bitte Zahl rechts wählen\",INDEX(Risikobewertung!$A$3:$A$7,MATCH(Beurteilung!H15,Risikobewertung!$G$3:$G$7,0)))","v":"#Bitte Zahl rechts wählen"},null,{"$f":"IF(OR(F15=\"\",H15=\"\"),\"Wertungen eingeben\",INDEX(Risikobewertung!$B$3:$F$7,MATCH(H15,Risikobewertung!$G$3:$G$7,0),MATCH(Beurteilung!F15,Risikobewertung!$B$8:$F$8,0)))","v":"Wertungen eingeben"},{"$f":"IF(OR(F15=\"\",H15=\"\"),\"\",INDEX(Risikobewertung!$G$33:$G$57,MATCH(F15&H15,Risikobewertung!$D$33:$D$57,0)))","v":""}]
[null,null,null,null,{"$f":"IF(F16=\"\",\"#bitte Buchstaben rechts wählen\",INDEX(Risikobewertung!$B$2:$F$2,MATCH(Beurteilung!F16,Risikobewertung!$B$8:$F$8,0)))","v":"#bitte Buchstaben rechts wählen"},null,{"$f":"IF(H16=\"\",\"#Bitte Zahl rechts wählen\",INDEX(Risikobewertung!$A$3:$A$7,MATCH(Beurteilung!H16,Risikobewertung!$G$3:$G$7,0)))","v":"#Bitte Zahl rechts wählen"},null,{"$f":"IF(OR(F16=\"\",H16=\"\"),\"Wertungen eingeben\",INDEX(Risikobewertung!$B$3:$F$7,MATCH(H16,Risikobewertung!$G$3:$G$7,0),MATCH(Beurteilung!F16,Risikobewertung!$B$8:$F$8,0)))","v":"Wertungen eingeben"},{"$f":"IF(OR(F16=\"\",H16=\"\"),\"\",INDEX(Risikobewertung!$G$33:$G$57,MATCH(F16&H16,Risikobewertung!$D$33:$D$57,0)))","v":""}]
[null,null,null,null,{"$f":"IF(F17=\"\",\"#bitte Buchstaben rechts wählen\",INDEX(Risikobewertung!$B$2:$F$2,MATCH(Beurteilung!F17,Risikobewertung!$B$8:$F$8,0)))","v":"#bitte Buchstaben rechts wählen"},null,{"$f":"IF(H17=\"\",\"#Bitte Zahl rechts wählen\",INDEX(Risikobewertung!$A$3:$A$7,MATCH(Beurteilung!H17,Risikobewertung!$G$3:$G$7,0)))","v":"#Bitte Zahl rechts wählen"},null,{"$f":"IF(OR(F17=\"\",H17=\"\"),\"Wertungen eingeben\",INDEX(Risikobewertung!$B$3:$F$7,MATCH(H17,Risikobewertung!$G$3:$G$7,0),MATCH(Beurteilung!F17,Risikobewertung!$B$8:$F$8,0)))","v":"Wertungen eingeben"},{"$f":"IF(OR(F17=\"\",H17=\"\"),\"\",INDEX(Risikobewertung!$G$33:$G$57,MATCH(F17&H17,Risikobewertung!$D$33:$D$57,0)))","v":""}]
[null,null,null,null,{"$f":"IF(F18=\"\",\"#bitte Buchstaben rechts wählen\",INDEX(Risikobewertung!$B$2:$F$2,MATCH(Beurteilung!F18,Risikobewertung!$B$8:$F$8,0)))","v":"#bitte Buchstaben rechts wählen"},null,{"$f":"IF(H18=\"\",\"#Bitte Zahl rechts wählen\",INDEX(Risikobewertung!$A$3:$A$7,MATCH(Beurteilung!H18,Risikobewertung!$G$3:$G$7,0)))","v":"#Bitte Zahl rechts wählen"},null,{"$f":"IF(OR(F18=\"\",H18=\"\"),\"Wertungen eingeben\",INDEX(Risikobewertung!$B$3:$F$7,MATCH(H18,Risikobewertung!$G$3:$G$7,0),MATCH(Beurteilung!F18,Risikobewertung!$B$8:$F$8,0)))","v":"Wertungen eingeben"},{"$f":"IF(OR(F18=\"\",H18=\"\"),\"\",INDEX(Risikobewertung!$G$33:$G$57,MATCH(F18&H18,Risikobewertung!$D$33:$D$57,0)))","v":""}]
[null,null,null,null,{"$f":"IF(F19=\"\",\"#bitte Buchstaben rechts wählen\",INDEX(Risikobewertung!$B$2:$F$2,MATCH(Beurteilung!F19,Risikobewertung!$B$8:$F$8,0)))","v":"#bitte Buchstaben rechts wählen"},null,{"$f":"IF(H19=\"\",\"#Bitte Zahl rechts wählen\",INDEX(Risikobewertung!$A$3:$A$7,MATCH(Beurteilung!H19,Risikobewertung!$G$3:$G$7,0)))","v":"#Bitte Zahl rechts wählen"},null,{"$f":"IF(OR(F19=\"\",H19=\"\"),\"Wertungen eingeben\",INDEX(Risikobewertung!$B$3:$F$7,MATCH(H19,Risikobewertung!$G$3:$G$7,0),MATCH(Beurteilung!F19,Risikobewertung!$B$8:$F$8,0)))","v":"Wertungen eingeben"},{"$f":"IF(OR(F19=\"\",H19=\"\"),\"\",INDEX(Risikobewertung!$G$33:$G$57,MATCH(F19&H19,Risikobewertung!$D$33:$D$57,0)))","v":""}]
[null,null,null,null,{"$f":"IF(F20=\"\",\"#bitte Buchstaben rechts wählen\",INDEX(Risikobewertung!$B$2:$F$2,MATCH(Beurteilung!F20,Risikobewertung!$B$8:$F$8,0)))","v":"#bitte Buchstaben rechts wählen"},null,{"$f":"IF(H20=\"\",\"#Bitte Zahl rechts wählen\",INDEX(Risikobewertung!$A$3:$A$7,MATCH(Beurteilung!H20,Risikobewertung!$G$3:$G$7,0)))","v":"#Bitte Zahl rechts wählen"},null,{"$f":"IF(OR(F20=\"\",H20=\"\"),\"Wertungen eingeben\",INDEX(Risikobewertung!$B$3:$F$7,MATCH(H20,Risikobewertung!$G$3:$G$7,0),MATCH(Beurteilung!F20,Risikobewertung!$B$8:$F$8,0)))","v":"Wertungen eingeben"},{"$f":"IF(OR(F20=\"\",H20=\"\"),\"\",INDEX(Risikobewertung!$G$33:$G$57,MATCH(F20&H20,Risikobewertung!$D$33:$D$57,0)))","v":""}]
[null,null,null,null,{"$f":"IF(F21=\"\",\"#bitte Buchstaben rechts wählen\",INDEX(Risikobewertung!$B$2:$F$2,MATCH(Beurteilung!F21,Risikobewertung!$B$8:$F$8,0)))","v":"#bitte Buchstaben rechts wählen"},null,{"$f":"IF(H21=\"\",\"#Bitte Zahl rechts wählen\",INDEX(Risikobewertung!$A$3:$A$7,MATCH(Beurteilung!H21,Risikobewertung!$G$3:$G$7,0)))","v":"#Bitte Zahl rechts wählen"},null,{"$f":"IF(OR(F21=\"\",H21=\"\"),\"Wertungen eingeben\",INDEX(Risikobewertung!$B$3:$F$7,MATCH(H21,Risikobewertung!$G$3:$G$7,0),MATCH(Beurteilung!F21,Risikobewertung!$B$8:$F$8,0)))","v":"Wertungen eingeben"},{"$f":"IF(OR(F21=\"\",H21=\"\"),\"\",INDEX(Risikobewertung!$G$33:$G$57,MATCH(F21&H21,Risikobewertung!$D$33:$D$57,0)))","v":""}]
[null,null,null,null,{"$f":"IF(F22=\"\",\"#bitte Buchstaben rechts wählen\",INDEX(Risikobewertung!$B$2:$F$2,MATCH(Beurteilung!F22,Risikobewertung!$B$8:$F$8,0)))","v":"#bitte Buchstaben rechts wählen"},null,{"$f":"IF(H22=\"\",\"#Bitte Zahl rechts wählen\",INDEX(Risikobewertung!$A$3:$A$7,MATCH(Beurteilung!H22,Risikobewertung!$G$3:$G$7,0)))","v":"#Bitte Zahl rechts wählen"},null,{"$f":"IF(OR(F22=\"\",H22=\"\"),\"Wertungen eingeben\",INDEX(Risikobewertung!$B$3:$F$7,MATCH(H22,Risikobewertung!$G$3:$G$7,0),MATCH(Beurteilung!F22,Risikobewertung!$B$8:$F$8,0)))","v":"Wertungen eingeben"},{"$f":"IF(OR(F22=\"\",H22=\"\"),\"\",INDEX(Risikobewertung!$G$33:$G$57,MATCH(F22&H22,Risikobewertung!$D$33:$D$57,0)))","v":""}]
[null,null,null,null,{"$f":"IF(F23=\"\",\"#bitte Buchstaben rechts wählen\",INDEX(Risikobewertung!$B$2:$F$2,MATCH(Beurteilung!F23,Risikobewertung!$B$8:$F$8,0)))","v":"#bitte Buchstaben rechts wählen"},null,{"$f":"IF(H23=\"\",\"#Bitte Zahl rechts wählen\",INDEX(Risikobewertung!$A$3:$A$7,MATCH(Beurteilung!H23,Risikobewertung!$G$3:$G$7,0)))","v":"#Bitte Zahl rechts wählen"},null,{"$f":"IF(OR(F23=\"\",H23=\"\"),\"Wertungen eingeben\",INDEX(Risikobewertung!$B$3:$F$7,MATCH(H23,Risikobewertung!$G$3:$G$7,0),MATCH(Beurteilung!F23,Risikobewertung!$B$8:$F$8,0)))","v":"Wertungen eingeben"},{"$f":"IF(OR(F23=\"\",H23=\"\"),\"\",INDEX(Risikobewertung!$G$33:$G$57,MATCH(F23&H23,Risikobewertung!$D$33:$D$57,0)))","v":""}]
[null,null,null,null,{"$f":"IF(F24=\"\",\"#bitte Buchstaben rechts wählen\",INDEX(Risikobewertung!$B$2:$F$2,MATCH(Beurteilung!F24,Risikobewertung!$B$8:$F$8,0)))","v":"#bitte Buchstaben rechts wählen"},null,{"$f":"IF(H24=\"\",\"#Bitte Zahl rechts wählen\",INDEX(Risikobewertung!$A$3:$A$7,MATCH(Beurteilung!H24,Risikobewertung!$G$3:$G$7,0)))","v":"#Bitte Zahl rechts wählen"},null,{"$f":"IF(OR(F24=\"\",H24=\"\"),\"Wertungen eingeben\",INDEX(Risikobewertung!$B$3:$F$7,MATCH(H24,Risikobewertung!$G$3:$G$7,0),MATCH(Beurteilung!F24,Risikobewertung!$B$8:$F$8,0)))","v":"Wertungen eingeben"},{"$f":"IF(OR(F24=\"\",H24=\"\"),\"\",INDEX(Risikobewertung!$G$33:$G$57,MATCH(F24&H24,Risikobewertung!$D$33:$D$57,0)))","v":""}]
[null,null,null,null,{"$f":"IF(F25=\"\",\"#bitte Buchstaben rechts wählen\",INDEX(Risikobewertung!$B$2:$F$2,MATCH(Beurteilung!F25,Risikobewertung!$B$8:$F$8,0)))","v":"#bitte Buchstaben rechts wählen"},null,{"$f":"IF(H25=\"\",\"#Bitte Zahl rechts wählen\",INDEX(Risikobewertung!$A$3:$A$7,MATCH(Beurteilung!H25,Risikobewertung!$G$3:$G$7,0)))","v":"#Bitte Zahl rechts wählen"},null,{"$f":"IF(OR(F25=\"\",H25=\"\"),\"Wertungen eingeben\",INDEX(Risikobewertung!$B$3:$F$7,MATCH(H25,Risikobewertung!$G$3:$G$7,0),MATCH(Beurteilung!F25,Risikobewertung!$B$8:$F$8,0)))","v":"Wertungen eingeben"},{"$f":"IF(OR(F25=\"\",H25=\"\"),\"\",INDEX(Risikobewertung!$G$33:$G$57,MATCH(F25&H25,Risikobewertung!$D$33:$D$57,0)))","v":""}]
[null,null,null,null,{"$f":"IF(F26=\"\",\"#bitte Buchstaben rechts wählen\",INDEX(Risikobewertung!$B$2:$F$2,MATCH(Beurteilung!F26,Risikobewertung!$B$8:$F$8,0)))","v":"#bitte Buchstaben rechts wählen"},null,{"$f":"IF(H26=\"\",\"#Bitte Zahl rechts wählen\",INDEX(Risikobewertung!$A$3:$A$7,MATCH(Beurteilung!H26,Risikobewertung!$G$3:$G$7,0)))","v":"#Bitte Zahl rechts wählen"},null,{"$f":"IF(OR(F26=\"\",H26=\"\"),\"Wertungen eingeben\",INDEX(Risikobewertung!$B$3:$F$7,MATCH(H26,Risikobewertung!$G$3:$G$7,0),MATCH(Beurteilung!F26,Risikobewertung!$B$8:$F$8,0)))","v":"Wertungen eingeben"},{"$f":"IF(OR(F26=\"\",H26=\"\"),\"\",INDEX(Risikobewertung!$G$33:$G$57,MATCH(F26&H26,Risikobewertung!$D$33:$D$57,0)))","v":""}]
[null,null,null,null,{"$f":"IF(F27=\"\",\"#bitte Buchstaben rechts wählen\",INDEX(Risikobewertung!$B$2:$F$2,MATCH(Beurteilung!F27,Risikobewertung!$B$8:$F$8,0)))","v":"#bitte Buchstaben rechts wählen"},null,{"$f":"IF(H27=\"\",\"#Bitte Zahl rechts wählen\",INDEX(Risikobewertung!$A$3:$A$7,MATCH(Beurteilung!H27,Risikobewertung!$G$3:$G$7,0)))","v":"#Bitte Zahl rechts wählen"},null,{"$f":"IF(OR(F27=\"\",H27=\"\"),\"Wertungen eingeben\",INDEX(Risikobewertung!$B$3:$F$7,MATCH(H27,Risikobewertung!$G$3:$G$7,0),MATCH(Beurteilung!F27,Risikobewertung!$B$8:$F$8,0)))","v":"Wertungen eingeben"},{"$f":"IF(OR(F27=\"\",H27=\"\"),\"\",INDEX(Risikobewertung!$G$33:$G$57,MATCH(F27&H27,Risikobewertung!$D$33:$D$57,0)))","v":""}]
[null,null,null,null,{"$f":"IF(F28=\"\",\"#bitte Buchstaben rechts wählen\",INDEX(Risikobewertung!$B$2:$F$2,MATCH(Beurteilung!F28,Risikobewertung!$B$8:$F$8,0)))","v":"#bitte Buchstaben rechts wählen"},null,{"$f":"IF(H28=\"\",\"#Bitte Zahl rechts wählen\",INDEX(Risikobewertung!$A$3:$A$7,MATCH(Beurteilung!H28,Risikobewertung!$G$3:$G$7,0)))","v":"#Bitte Zahl rechts wählen"},null,{"$f":"IF(OR(F28=\"\",H28=\"\"),\"Wertungen eingeben\",INDEX(Risikobewertung!$B$3:$F$7,MATCH(H28,Risikobewertung!$G$3:$G$7,0),MATCH(Beurteilung!F28,Risikobewertung!$B$8:$F$8,0)))","v":"Wertungen eingeben"},{"$f":"IF(OR(F28=\"\",H28=\"\"),\"\",INDEX(Risikobewertung!$G$33:$G$57,MATCH(F28&H28,Risikobewertung!$D$33:$D$57,0)))","v":""}]
[null,null,null,null,{"$f":"IF(F29=\"\",\"#bitte Buchstaben rechts wählen\",INDEX(Risikobewertung!$B$2:$F$2,MATCH(Beurteilung!F29,Risikobewertung!$B$8:$F$8,0)))","v":"#bitte Buchstaben rechts wählen"},null,{"$f":"IF(H29=\"\",\"#Bitte Zahl rechts wählen\",INDEX(Risikobewertung!$A$3:$A$7,MATCH(Beurteilung!H29,Risikobewertung!$G$3:$G$7,0)))","v":"#Bitte Zahl rechts wählen"},null,{"$f":"IF(OR(F29=\"\",H29=\"\"),\"Wertungen eingeben\",INDEX(Risikobewertung!$B$3:$F$7,MATCH(H29,Risikobewertung!$G$3:$G$7,0),MATCH(Beurteilung!F29,Risikobewertung!$B$8:$F$8,0)))","v":"Wertungen eingeben"},{"$f":"IF(OR(F29=\"\",H29=\"\"),\"\",INDEX(Risikobewertung!$G$33:$G$57,MATCH(F29&H29,Risikobewertung!$D$33:$D$57,0)))","v":""}]
[null,null,null,null,{"$f":"IF(F30=\"\",\"#bitte Buchstaben rechts wählen\",INDEX(Risikobewertung!$B$2:$F$2,MATCH(Beurteilung!F30,Risikobewertung!$B$8:$F$8,0)))","v":"#bitte Buchstaben rechts wählen"},null,{"$f":"IF(H30=\"\",\"#Bitte Zahl rechts wählen\",INDEX(Risikobewertung!$A$3:$A$7,MATCH(Beurteilung!H30,Risikobewertung!$G$3:$G$7,0)))","v":"#Bitte Zahl rechts wählen"},null,{"$f":"IF(OR(F30=\"\",H30=\"\"),\"Wertungen eingeben\",INDEX(Risikobewertung!$B$3:$F$7,MATCH(H30,Risikobewertung!$G$3:$G$7,0),MATCH(Beurteilung!F30,Risikobewertung!$B$8:$F$8,0)))","v":"Wertungen eingeben"},{"$f":"IF(OR(F30=\"\",H30=\"\"),\"\",INDEX(Risikobewertung!$G$33:$G$57,MATCH(F30&H30,Risikobewertung!$D$33:$D$57,0)))","v":""}]
{"$rows_left_out":49}
{"sheet":"Gefährdungsfaktoren","index":1,"n_rows":70,"n_cols":3,"rows_kept":70,"cut":false,"hidden":false,"merged":[[0,0,0,2],[62,0,63,0],[62,2,63,2],[56,2,57,2],[58,0,59,0],[58,2,59,2],[60,0,61,0],[60,2,61,2],[56,0,57,0]]}
["Ermittlung und Klassifikation der Gefährdungen"]
["Nr.","Art der Gefährdungsfaktoren","Vorhanden"]
["(Klassifikation)",null,"ja"]
[1,"Mechanische Gefährdungen"]
["1.1","Bewegte Teile","☐"]
["1.2","Oberflächenbeschaffenheit","☐"]
["1.3","Bewegte Transport-/Arbeitsmittel","☐"]
["1.4","Unkontrolliert bewegte oder herabfallende Teile","☐"]
["1.5","Sturz, Ausrutschen, Stolpern, Umknicken","☐"]
["1.6","Absturz","☐"]
[2,"Elektrische Gefährdungen"]
["2.1","Körperdurchströmung, elektrischer Schlag","☐"]
["2.2","Lichtbögen","☐"]
["2.3","Elektrostatische Aufladung","☐"]
[3,"Chemische Gefährdungen - Gefahrstoffe"]
["3.1","Hautkontakt mit Gefahrstoffen (Flüssigkeiten, Feststoffe, Gase)","☐"]
["3.2","Verschlucken von Gefahrstoffen (Flüssigkeiten, Feststoffe, Gase)","☐"]
["3.3","Einatmen von Gefahrstoffen (Gase, Stäube, Nebel, Dämpfe)","☐"]
["3.4","Arbeiten in feuchtem Milieu","☐"]
[4,"Biologische Gefährdungen"]
["4.1","Infektionsgefährdung durch pathogene Mikroorganismen\n(Bakterien, Viren, Pilze)","☐"]
["4.2","Genetisch veränderte Organismen","☐"]
["4.3","Sensibilisierende und toxische Wirkung von Mikroorganismen","☐"]
["4.4","Sensibilisierende und toxische Wirkung von Pflanzenstoffen","☐"]
[5,"Brand und Explosionsgefährdungen"]
["5.1","Brandgefährdung durch Feststoffe, Flüssigkeiten oder Gase","☐"]
["5.2","Explosionsfähige Atmosphäre","☐"]
["5.3","Explosivstoffe","☐"]
[6,"Thermische Gefährdungen"]
["6.1","Heiße Medien","☐"]
{"$rows_left_out":41}
{"sheet":"Risikobewertung","index":2,"n_rows":57,"n_cols":7,"rows_kept":57,"cut":false,"hidden":false,"merged":[[0,0,0,5]]}
["Risikomatrix nach Nohl"]
["             Schadensausmaß \nEintritts-\nwahrscheinlichkeit","keine Gesundheitlichen Folgen\n","Bagatellfolgen/ geringe Folgen (Die Arbeit kann fortgesetzt werden)","Mäßig schwere Folgen (Arbeitsausfall ohne Dauerschäden)","Schwere Folgen (irreperable Dauerschäden möglich)","Tödliche Folgen \n"]
["nahezu unmöglich","extrem gering [1]","extrem gering [1]","sehr gering [2]","gering bis mittel","mittel [4]",1]
["vorstellbar, aber unwahrscheinlich","extrem gering [1]","sehr gering [2]","gering bis mittel [3]","mittel [4]","hoch [5]",2]
["gelegentlich möglich","sehr gering [2]","gering bis mittel [3]","mittel [4]","hoch [5]","sehr hoch [6]",3]
["gut möglich","sehr gering [2]","mittel [4]","hoch [5]","sehr hoch [6]","extrem hoch [7]",4]
["fast gewiss","sehr gering [2]","mittel [4]","sehr hoch [6]","sehr hoch [6]","extrem hoch [7]",5]
[null,"A","B","C","D","E"]
[]
[]
[]
[]
[]
[]
[]
[]
[]
[]
[]
[]
[]
[]
[]
[]
[]
[]
[]
[]
[]
[]
{"$rows_left_out":27}